{"text_format":"1","workbook":"xlsx","n_sheets":3,"sheets":["Key","Notes","NCNF"],"not_rendered":{"charts":0,"images":7,"macros":1,"external_links":0,"defined_names":1,"comments":0,"pivot_tables":0},"unopened":[],"bounds":{"document_bytes":16777216,"sheet_cells":100000,"rows_first":2000,"rows_last":500,"rows_between":2000,"halvings":0,"cell_chars":16384,"cell_head_chars":4096},"cells_cut":0,"cells_raw":0,"read":"whole","date_system":"1900"}

{"sheet":"Key","index":0,"n_rows":445,"n_cols":53,"rows_kept":445,"cut":false,"hidden":true,"merged":[]}
["State","Abbreviation",null,"SIC Code","Industry Title",null,"Current Funding",null,"Sales Executives",null,"Underwriters",null,"Senior Consultants",null,"Account Managers",null,"Account Coordinator",null,"Pharmacy Liason",null,"LH Client Manager",null,"LH Client Coordinator",null,"Networks",null,"Out of Network Vendors",null,"Aetna - Network Platform",null,"Anthem Models",null,"RBP Network",null,"PBMs",null,"Rebate Retention",null,"Dental",null,"Vision",null,"HSA",null,"Flex Admin - Health",null,"Wellness",null,"Teladoc",null,"Teladoc - Billing Arrangement",null,"Healthcare Bluebook"]
["Alabama","AL",null,100,"AGRICULTURAL PRODUCTION-CROPS",null,"Fully Insured",null,"Andrea Dennis","adennis@evhc.com","Beth Rangel","brangel@evhc.com","Bob Watt","rwatt@evhc.com","Athena Smith","asmith@evhc.com","Meredith Osborne","mosborne@evhc.com","Cassy Wheeler","cwheeler@evhc.com",null,null,null,null,"Aetna",null,"Edge (std)",null,"1.0",null,"Aggregator",null,"Full",null,"MedImpact (std)",null,"EVHC (std)",null,"Cigna Dental SA",null,"Avesis",null,"HSA Bank",null,"Full",null,"Vigoroom",null,"Medical & Behavioral Health (std)",null,"With Consult",null,"EE 1099'd"]
["Alaska","AK",null,200,"AGRICULTURAL PROD-LIVESTOCK & ANIMAL SPECIALTIES",null,"Self Insured",null,"Anthony Robinson","arobinsonjr@evhc.com","Chris Baker","cbaker@evhc.com","Chris Stolze","cstolze@evhc.com","Danna Stephens","dstephens@evhc.com","Shayleen Thomas","sthomas@evhc.com","Catherine Hibbert","chibbert@evhc.com",null,null,null,null,"Anthem",null,"Multiplan",null,"2.0",null,"Traditional (CA Only)",null,"Dual",null,"Carelon (only available with Anthem)",null,"Client",null,"Guardian (Dental Guard Preferred Select Network)",null,"VSP",null,null,null,"Limited",null,"Population Health",null,"Medical Only",null,"Without Consult",null,"ER Invoiced"]
["Arizona","AZ",null,700,"AGRICULTURAL SERVICES",null,"Level Funded",null,"Brent Starling","bstarling@evhc.com","Dylan Shackelford","dshackelford@evhc.com","Dan Breedlove","dbreedlove@evhc.com","Erica Guzman","eguzman@evhc.com",null,null,"Katie Sells","ksells@evhc.com",null,null,null,null,"Cigna",null,"% of Medicare",null,"2.5",null,null,null,null,null,null,null,"Other",null,"Anthem",null,"EyeMed",null,null,null,"Full & Limited"]
["Arkansas","AR",null,800,"FORESTRY",null,null,null,"Chandler Kaltenbach","ckaltenbach@evhc.com","Jon Miller","jmiller@evhc.com","Hope Crawford","hcrawford@evhc.com","Jay Fahrer","jfahrer@evhc.com",null,null,"Katie Smith","ksmith@evhc.com",null,null,null,null,"Highmark",null,"% of HIAA",null,"3.0",null,null,null,null,null,null,null,null,null,"Aetna ADA",null,"Guardian"]
["California","CA",null,900,"FISHING, HUNTING AND TRAPPING",null,null,null,"Darick Bradford","dbradford@evhc.com","Justin DaCosta","jdacosta@evhc.com","James Huynh","jhuynh@evhc.com","Karen Ellis","kellis@evhc.com",null,null,"Mckayla Hadean","mhadean@evhc.com",null,null,null,null,"UHC",null,"RBP - ELAP"]
["Colorado","CO",null,1000,"METAL MINING",null,null,null,"Erin Frink","efrink@evhc.com","Larry Folz","lfolz@evhc.com","Lynn Zeiner","lzeiner@evhc.com","Mark Tramontana","mtramontana@evhc.com",null,null,null,null,null,null,null,null,"RBP - AMPS",null,"RBP - AMPS"]
["Connecticut","CT",null,1040,"GOLD AND SILVER ORES",null,null,null,"Evan Taub","etaub@evhc.com","Lisa Truskowski","ltruskowski@evhc.com","Pam Saunders","psaunders@evhc.com","Megan Grafton","mgrafton@evhc.com",null,null,null,null,null,null,null,null,"RBP - ELAP",null,"Anthem"]
["Delaware","DE",null,1090,"MISCELLANEOUS METAL ORES",null,null,null,"James Corrales","jcorrales@evhc.com","Melissa Rangel","mrangel@evhc.com","Sean Leonard","sleonard@evhc.com","Rachael Marks","rmarks@evhc.com"]
["District of Columbia","DC",null,1220,"BITUMINOUS COAL & LIGNITE MINING",null,null,null,"John Dallo","jdallo@evhc.com","Tucker Sullivan","jsullivan@evhc.com","Shaniqua Lawrence","slawrence@evhc.com","Tiffany Manik","tmanik@evhc.com"]
["Florida","FL",null,1221,"BITUMINOUS COAL & LIGNITE SURFACE MINING",null,null,null,"Josh Haskett","jhaskett@evhc.com","Will Wilson","wwilson@evhc.com",null,null,"Tyler Stephens","tstephens@evhc.com"]
["Georgia","GA",null,1311,"CRUDE PETROLEUM & NATURAL GAS",null,null,null,"Robert Painter","rpainter@evhc.com"]
["Hawaii","HI",null,1381,"DRILLING OIL & GAS WELLS",null,null,null,"Ryan French","rfrench@evhc.com"]
["Idaho","ID",null,1382,"OIL & GAS FIELD EXPLORATION SERVICES"]
["Illinois","IL",null,1389,"OIL & GAS FIELD SERVICES, NEC"]
["Indiana","IN",null,1400,"MINING & QUARRYING OF NONMETALLIC MINERALS (NO FUELS)"]
["Iowa","IA",null,1520,"GENERAL BLDG CONTRACTORS - RESIDENTIAL BLDGS"]
["Kansas","KS",null,1531,"OPERATIVE BUILDERS"]
["Kentucky","KY",null,1540,"GENERAL BLDG CONTRACTORS - NONRESIDENTIAL BLDGS"]
["Louisiana","LA",null,1600,"HEAVY CONSTRUCTION OTHER THAN BLDG CONST - CONTRACTORS"]
["Maine","ME",null,1623,"WATER, SEWER, PIPELINE, COMM & POWER LINE CONSTRUCTION"]
["Maryland","MD",null,1700,"CONSTRUCTION - SPECIAL TRADE CONTRACTORS"]
["Massachusetts","MA",null,1731,"ELECTRICAL WORK"]
["Michigan","MI",null,2000,"FOOD AND KINDRED PRODUCTS"]
["Minnesota","MN",null,2011,"MEAT PACKING PLANTS"]
["Mississippi","MS",null,2013,"SAUSAGES & OTHER PREPARED MEAT PRODUCTS"]
["Missouri","MO",null,2015,"POULTRY SLAUGHTERING AND PROCESSING"]
["Montana","MT",null,2020,"DAIRY PRODUCTS"]
["Nebraska","NE",null,2024,"ICE CREAM & FROZEN DESSERTS"]
["Nevada","NV",null,2030,"CANNED, FROZEN & PRESERVD FRUIT, VEG & FOOD SPECIALTIES"]
["New Hampshire","NH",null,2033,"CANNED, FRUITS, VEG, PRESERVES, JAMS & JELLIES"]
["New Jersey","NJ",null,2040,"GRAIN MILL PRODUCTS"]
["New Mexico","NM",null,2050,"BAKERY PRODUCTS"]
["New York","NY",null,2052,"COOKIES & CRACKERS"]
["North Carolina","NC",null,2060,"SUGAR & CONFECTIONERY PRODUCTS"]
["North Dakota","ND",null,2070,"FATS & OILS"]
["Ohio","OH",null,2080,"BEVERAGES"]
["Oklahoma","OK",null,2082,"MALT BEVERAGES"]
["Oregon","OR",null,2086,"BOTTLED & CANNED SOFT DRINKS & CARBONATED WATERS"]
["Pennsylvania","PA",null,2090,"MISCELLANEOUS FOOD PREPARATIONS & KINDRED PRODUCTS"]
["Rhode Island","RI",null,2092,"PREPARED FRESH OR FROZEN FISH & SEAFOODS"]
["South Carolina","SC",null,2100,"TOBACCO PRODUCTS"]
["South Dakota","SD",null,2111,"CIGARETTES"]
["Tennessee","TN",null,2200,"TEXTILE MILL PRODUCTS"]
["Texas","TX",null,2211,"BROADWOVEN FABRIC MILLS, COTTON"]
["Utah","UT",null,2221,"BROADWOVEN FABRIC MILLS, MAN MADE FIBER & SILK"]
["Vermont","VT",null,2250,"KNITTING MILLS"]
["Virginia","VA",null,2253,"KNIT OUTERWEAR MILLS"]
["Washington","WA",null,2273,"CARPETS & RUGS"]
["West Virginia","WV",null,2300,"APPAREL & OTHER FINISHD PRODS OF FABRICS & SIMILAR MATL"]
["Wisconsin","WI",null,2320,"MEN'S & BOYS' FURNISHGS, WORK CLOTHG, & ALLIED GARMENTS"]
["Wyoming","WY",null,2330,"WOMEN'S, MISSES', AND JUNIORS OUTERWEAR"]
[null,null,null,2340,"WOMEN'S, MISSES', CHILDREN'S & INFANTS' UNDERGARMENTS"]
[null,null,null,2390,"MISCELLANEOUS FABRICATED TEXTILE PRODUCTS"]
[null,null,null,2400,"LUMBER & WOOD PRODUCTS (NO FURNITURE)"]
[null,null,null,2421,"SAWMILLS & PLANTING MILLS, GENERAL"]
[null,null,null,2430,"MILLWOOD, VENEER, PLYWOOD, & STRUCTURAL WOOD MEMBERS"]
[null,null,null,2451,"MOBILE HOMES"]
[null,null,null,2452,"PREFABRICATED WOOD BLDGS & COMPONENTS"]
[null,null,null,2510,"HOUSEHOLD FURNITURE"]
[null,null,null,2511,"WOOD HOUSEHOLD FURNITURE, (NO UPHOLSTERED)"]
[null,null,null,2520,"OFFICE FURNITURE"]
[null,null,null,2522,"OFFICE FURNITURE (NO WOOD)"]
[null,null,null,2531,"PUBLIC BLDG & RELATED FURNITURE"]
[null,null,null,2540,"PARTITIONS, SHELVG, LOCKERS, & OFFICE & STORE FIXTURES"]
[null,null,null,2590,"MISCELLANEOUS FURNITURE & FIXTURES"]
[null,null,null,2600,"PAPERS & ALLIED PRODUCTS"]
[null,null,null,2611,"PULP MILLS"]
[null,null,null,2621,"PAPER MILLS"]
[null,null,null,2631,"PAPERBOARD MILLS"]
[null,null,null,2650,"PAPERBOARD CONTAINERS & BOXES"]
[null,null,null,2670,"CONVERTED PAPER & PAPERBOARD PRODS (NO CONTANERS/BOXES)"]
[null,null,null,2673,"PLASTICS, FOIL & COATED PAPER BAGS"]
[null,null,null,2711,"NEWSPAPERS: PUBLISHING OR PUBLISHING & PRINTING"]
[null,null,null,2721,"PERIODICALS: PUBLISHING OR PUBLISHING & PRINTING"]
[null,null,null,2731,"BOOKS: PUBLISHING OR PUBLISHING & PRINTING"]
[null,null,null,2732,"BOOK PRINTING"]
[null,null,null,2741,"MISCELLANEOUS PUBLISHING"]
[null,null,null,2750,"COMMERCIAL PRINTING"]
[null,null,null,2761,"MANIFOLD BUSINESS FORMS"]
{"$rows_left_out":366}
{"sheet":"Notes","index":1,"n_rows":93,"n_cols":40,"rows_kept":93,"cut":false,"hidden":false,"merged":[[70,2,70,33],[4,39,4,85],[2,39,2,85],[16,39,16,85],[6,2,6,33],[4,2,4,33],[2,2,2,33],[37,2,37,33],[68,2,68,33]]}
[]
[]
[null,null,"TO ENABLE MACROS",null,null,null,null,null,null,null,null,null,null,null,null,null,null,null,null,null,null,null,null,null,null,null,null,null,null,null,null,null,null,null,null,null,null,null,null,"TO ENABLE EMAIL FEATURE"]
[]
[null,null,"1) File ---> Options (bottom)",null,null,null,null,null,null,null,null,null,null,null,null,null,null,null,null,null,null,null,null,null,null,null,null,null,null,null,null,null,null,null,null,null,null,null,null,"1) Right click any blank space in top ribbon ---> Click Customize The Ribbon…"]
[]
[null,null,"2) Select Trust Center from left side ribbon (bottom) and click Trust Center Settings… button"]
[]
[]
[]
[]
[]
[]
[]
[]
[]
[null,null,null,null,null,null,null,null,null,null,null,null,null,null,null,null,null,null,null,null,null,null,null,null,null,null,null,null,null,null,null,null,null,null,null,null,null,null,null,"2) Check Developer from list on right side and hit OK"]
[]
[]
[]
[]
[]
[]
[]
[]
[]
[]
[]
[]
[]
[]
[]
[]
[]
[]
[]
[]
[null,null,"3) Select Macro Settings from left side ribbon (middle) and select Enable VBA macros (not recommended; potentially dangerous code can run) button"]
[]
[]
[]
[]
[]
[]
[]
[]
[]
[]
[]
[]
[]
[]
[null,null,null,null,null,null,null,null,null,null,null,null,null,null,null,null,null,null,null,null,null,null,null,null,null,null,null,null,null,null,null,null,null,null,null,null,null,null,null,"3) Go to Developer toolbar (left of Help) and click Visual Basic (first option)"]
[]
[]
[]
[]
[]
[]
[]
[]
[]
[]
[]
[]
[]
[null,null,null,null,null,null,null,null,null,null,null,null,null,null,null,null,null,null,null,null,null,null,null,null,null,null,null,null,null,null,null,null,null,null,null,null,null,null,null,"4) Go to Tools (top options bar) and click References... (first option) and check Microsoft Outlook 16.0 Object Library and hit OK"]
[]
[null,null,"4) Hit OK and OK"]
[]
[null,null,"5) Restart Excel"]
[]
[]
[]
[]
[]
[]
[]
[]
[]
{"$rows_left_out":14}
{"sheet":"NCNF","index":2,"n_rows":209,"n_cols":47,"rows_kept":209,"cut":false,"hidden":false,"merged":[[118,21,118,23],[116,23,116,28],[116,30,116,32],[142,25,142,27],[146,43,146,50],[146,35,146,41],[46,39,46,50],[122,6,122,10],[108,39,108,50],[116,40,116,50],[112,12,112,50],[138,12,138,14],[138,16,138,19],[138,21,138,23],[110,12,110,15],[114,6,114,10],[84,6,84,10],[106,26,106,28],[106,30,106,31],[110,17,110,19],[110,21,110,24],[110,26,110,28],[116,12,116,21],[118,12,118,14],[116,6,116,10],[118,6,118,10],[118,16,118,19],[146,2,146,4],[160,18,160,22],[172,12,172,22],[144,6,144,10],[140,6,140,10],[142,6,142,10],[142,12,142,14],[142,16,142,19],[142,21,142,23],[146,12,146,14],[144,2,144,4],[140,2,140,4],[146,6,146,10],[124,6,124,10],[152,6,152,14],[154,6,154,10],[154,12,154,19],[156,6,156,15],[170,2,170,4],[154,2,154,4],[152,2,152,4],[2,38,2,50],[2,2,2,37],[160,6,160,10],[170,6,170,10],[170,12,170,29],[48,12,48,15],[134,12,134,14],[134,16,134,29],[160,12,160,16],[114,2,114,4],[130,2,130,4],[116,34,116,39],[130,12,130,14],[130,16,130,29],[120,25,120,27],[136,2,136,4],[136,6,136,10],[138,45,138,47],[138,25,138,27],[148,6,148,10],[148,2,148,4],[162,2,162,4],[44,12,44,21],[44,26,44,37],[4,2,4,50],[27,2,27,50],[29,2,29,9],[31,2,31,9],[20,45,20,50],[6,11,6,37],[12,11,12,37],[14,11,14,37],[16,11,16,37],[18,11,18,37],[20,11,20,37],[12,39,12,43],[14,39,14,43],[16,39,16,43],[29,40,29,50],[24,2,24,9],[22,11,22,50],[16,2,16,9],[18,2,18,9],[20,2,20,9],[8,11,8,37],[10,34,10,37],[8,39,8,43],[6,45,6,50],[8,45,8,50],[10,45,10,50],[10,31,10,32],[6,39,6,43],[10,39,10,43],[6,2,6,9],[8,2,8,9],[10,2,10,9],[10,11,10,29],[12,45,12,50],[14,45,14,50],[33,2,33,9],[31,31,31,38],[29,31,29,38],[29,11,29,29],[31,11,31,29],[24,11,24,50],[33,40,33,50],[33,31,33,38],[33,11,33,29],[31,40,31,42],[31,44,31,49],[20,39,20,43],[18,39,18,43],[18,45,18,50],[12,2,12,9],[14,2,14,9],[22,2,22,9],[16,45,16,50],[35,2,35,9],[37,2,37,9],[39,2,39,9],[37,31,37,38],[35,31,35,38],[39,31,39,38],[35,11,35,29],[106,23,106,24],[46,12,46,21],[48,6,48,10],[64,12,64,15],[66,6,66,10],[67,6,67,10],[68,6,68,10],[69,6,69,10],[70,6,70,10],[72,6,72,10],[73,6,73,10],[65,6,65,10],[98,6,98,10],[99,6,99,10],[100,6,100,10],[37,11,37,29],[39,11,39,29],[42,2,42,50],[44,2,44,4],[104,2,104,4],[44,6,44,10],[46,6,46,10],[104,6,104,10],[35,40,35,50],[37,40,37,50],[39,40,39,50],[46,23,46,30],[46,32,46,37],[104,12,104,25],[85,6,85,10],[86,6,86,10],[88,6,88,10],[101,6,101,10],[102,6,102,10],[49,6,49,10],[57,6,57,10],[58,12,58,15],[59,6,59,10],[60,6,60,10],[61,6,61,10],[62,6,62,10],[106,12,106,21],[56,39,56,50],[63,6,63,10],[64,6,64,10],[50,6,50,10],[51,6,51,10],[52,6,52,10],[53,6,53,10],[54,6,54,10],[56,6,56,10],[58,6,58,10],[56,12,56,15],[56,17,56,19],[56,21,56,27],[56,29,56,37],[58,17,58,34],[88,12,88,15],[96,12,96,15],[110,37,110,50],[112,6,112,10],[110,6,110,10],[106,33,106,35],[138,37,138,39],[74,6,74,10],[75,6,75,10],[76,6,76,10],[77,6,77,10],[78,6,78,10],[80,6,80,10],[81,6,81,10],[120,6,120,10],[120,12,120,14],[120,16,120,19],[120,21,120,23],[120,29,120,31],[82,6,82,10],[83,6,83,10],[128,12,128,50],[138,6,138,10],[138,29,138,31],[138,33,138,35],[106,6,106,10],[179,38,179,40],[179,42,179,44],[179,46,179,48],[178,10,178,12],[174,2,174,50],[132,2,132,4],[89,6,89,10],[90,6,90,10],[91,6,91,10],[92,6,92,10],[93,6,93,10],[94,6,94,10],[95,6,95,10],[96,6,96,10],[97,6,97,10],[130,6,130,10],[132,6,132,10],[108,6,108,10],[108,12,108,14],[108,16,108,19],[108,21,108,23],[108,25,108,37],[110,30,110,31],[110,33,110,35],[166,12,166,27],[178,28,178,30],[178,14,178,16],[150,2,150,4],[150,6,150,11],[162,6,162,10],[166,6,166,10],[178,34,178,36],[179,22,179,24],[179,18,179,20],[179,14,179,16],[179,10,179,12],[177,10,177,12],[176,9,176,25],[177,14,177,16],[177,18,177,20],[177,22,177,24],[179,34,179,36],[122,12,122,14],[124,12,124,14],[126,12,126,14],[122,16,122,22],[124,16,124,22],[126,16,126,22],[142,29,142,31],[176,27,176,31],[152,16,152,21],[158,6,158,15],[148,13,148,22],[150,13,150,15],[150,17,150,19],[150,21,150,25],[150,27,150,31],[146,16,146,26],[134,6,134,10],[164,6,164,50],[168,6,168,50],[172,6,172,10],[142,33,142,50],[144,12,144,14],[144,16,144,26],[162,12,162,27],[146,28,146,33],[176,3,176,7],[160,24,160,34],[128,6,128,10],[126,6,126,10],[176,33,176,49],[132,12,132,14],[132,16,132,29],[178,38,178,40],[178,42,178,44],[178,46,178,48],[177,34,177,36],[177,38,177,40],[177,42,177,44],[177,46,177,48],[138,41,138,43],[134,2,134,4],[178,18,178,20],[178,22,178,24],[160,2,160,4],[158,2,158,4],[156,2,156,4],[166,2,166,4],[178,4,178,6]]}
[]
[]
[null,null,"NEW CLIENT NOTIFICATION FORM",null,null,null,null,null,null,null,null,null,null,null,null,null,null,null,null,null,null,null,null,null,null,null,null,null,null,null,null,null,null,null,null,null,null,null,{"$error":"#VALUE!"}]
[]
[null,null,"CLIENT"]
[]
[null,null,"Client's Legal Name",null,null,null,null,null,null,null,null,null,null,null,null,null,null,null,null,null,null,null,null,null,null,null,null,null,null,null,null,null,null,null,null,null,null,null,null,"TIN"]
[]
[null,null,"Name for ID Card",null,null,null,null,null,null,null,null,null,null,null,null,null,null,null,null,null,null,null,null,null,null,null,null,null,null,null,null,null,null,null,null,null,null,null,null,"Effective Date"]
[]
[null,null,"Corporate Address",null,null,null,null,null,null,null,null,null,null,null,null,null,null,null,null,null,null,null,null,null,null,null,null,null,null,null,null,"State",null,null,null,null,null,null,null,"Zip"]
[]
[null,null,"Nature of Business",null,null,null,null,null,null,null,null,{"$f":"IF(AT13=\"\",\"\",_xlfn.XLOOKUP(AT13,Key!D:D,Key!E:E))","v":""},null,null,null,null,null,null,null,null,null,null,null,null,null,null,null,null,null,null,null,null,null,null,null,null,null,null,null,"SIC Code"]
[]
[null,null,"Current Funding",null,null,null,null,null,null,null,null,null,null,null,null,null,null,null,null,null,null,null,null,null,null,null,null,null,null,null,null,null,null,null,null,null,null,null,null,{"$f":"IF(L15=\"Self Insured\", \"Run-In Needed?\",\"\")","v":""}]
[]
[null,null,"Current Administrator",null,null,null,null,null,null,null,null,null,null,null,null,null,null,null,null,null,null,null,null,null,null,null,null,null,null,null,null,null,null,null,null,null,null,null,null,"Subscribers"]
[]
[null,null,"Current Network",null,null,null,null,null,null,null,null,null,null,null,null,null,null,null,null,null,null,null,null,null,null,null,null,null,null,null,null,null,null,null,null,null,null,null,null,"HSA Account w Bank"]
[]
[null,null,"Current PBM",null,null,null,null,null,null,null,null,null,null,null,null,null,null,null,null,null,null,null,null,null,null,null,null,null,null,null,null,null,null,null,null,null,null,null,null,"Retained Rebates?"]
[]
[null,null,"Reason For Moving"]
[]
[null,null,"Client Expectations"]
[]
[]
[null,null,"TEAM"]
[]
[null,null,"Broker Contact",null,null,null,null,null,null,null,null,null,null,null,null,null,null,null,null,null,null,null,null,null,null,null,null,null,null,null,null,"GA"]
[]
[null,null,"Brokerage",null,null,null,null,null,null,null,null,null,null,null,null,null,null,null,null,null,null,null,null,null,null,null,null,null,null,null,null,"New Broker",null,null,null,null,null,null,null,null,null,null,null,null,{"$f":"IF(AO32=\"Yes\",\"W-9 Required\",\"\")","v":""}]
[]
[null,null,"Sales Executive",null,null,null,null,null,null,null,{"$f":"IF(L34=\"\",\"\",_xlfn.XLOOKUP(L34,Key!I:I,Key!J:J))","v":""},null,null,null,null,null,null,null,null,null,null,null,null,null,null,null,null,null,null,null,null,"Underwriter",null,null,null,null,null,null,null,{"$f":"IF(AO34=\"\",\"\",_xlfn.XLOOKUP(AO34,Key!K:K,Key!L:L))","v":""}]
[]
[null,null,"Senior Consultant",null,null,null,null,null,null,null,{"$f":"IF(L36=\"\",\"\",_xlfn.XLOOKUP(L36,Key!M:M,Key!N:N))","v":""},null,null,null,null,null,null,null,null,null,null,null,null,null,null,null,null,null,null,null,null,"Senior Account Manager",null,null,null,null,null,null,null,{"$f":"IF(AO36=\"\",\"\",_xlfn.XLOOKUP(AO36,Key!O:O,Key!P:P))","v":""}]
[]
[null,null,"Pharmacy Liason",null,null,null,null,null,null,null,{"$f":"IF(L38=\"\",\"\",_xlfn.XLOOKUP(L38,Key!S:S,Key!T:T))","v":""},null,null,null,null,null,null,null,null,null,null,null,null,null,null,null,null,null,null,null,null,"Account Coordinator",null,null,null,null,null,null,null,{"$f":"IF(AO38=\"\",\"\",_xlfn.XLOOKUP(AO38,Key!Q:Q,Key!R:R))","v":""}]
[]
[null,null,"LH Client Manager",null,null,null,null,null,null,null,{"$f":"IF(L40=\"\",\"\",_xlfn.XLOOKUP(L40,Key!U:U,Key!V:V))","v":""},null,null,null,null,null,null,null,null,null,null,null,null,null,null,null,null,null,null,null,null,"LH Client Coordinator",null,null,null,null,null,null,null,{"$f":"IF(AO40=\"\",\"\",_xlfn.XLOOKUP(AO40,Key!W:W,Key!X:X))","v":""}]
[]
[]
[null,null,"PRODUCTS & SERVICES SOLD"]
[]
[null,null,null,null,null,null,"Medical",null,null,null,null,null,{"$f":"IF(OR(M47=\"Anthem\",M47=\"Highmark\"),\"Signed JAA Required\",\"\")","v":""},null,null,null,null,null,null,null,null,null,null,null,null,null,{"$f":"IF(M47=\"Anthem\",\"Anthem OON Required\",\"\")","v":""}]
[]
[null,null,null,null,null,null,"Network",null,null,null,null,null,null,null,null,null,null,null,null,null,null,null,null,"Out of Network Vendor",null,null,null,null,null,null,null,null,null,null,null,null,null,null,null,{"$f":"IF(M47=\"Anthem\",\"Requires 60 Days to Implement\",\"\")","v":""}]
[]
[null,null,null,null,null,null,"Network Platform"]
[null,null,null,null,null,null,"Aetna2"]
[null,null,null,null,null,null,"Aetna3"]
[null,null,null,null,null,null,"Aetna4"]
[null,null,null,null,null,null,"Aetna5"]
[null,null,null,null,null,null,"Aetna6"]
[null,null,null,null,null,null,"Aetna7"]
[]
[null,null,null,null,null,null,"State",null,null,null,null,null,null,null,null,null,null,"Model",null,null,null,null,null,null,null,null,null,null,null,{"$f":"IF(M57=\"\",\"\",IF(OR(M57=\"California\",M57=\"CA\"),\"Choose Aggregator or Traditional\",\"Aggregator Model Required\"))","v":""},null,null,null,null,null,null,null,null,null,{"$f":"IF(V57=\"Aggregator\",\"Sales Must Communicate Cost to Client\",\"\")","v":""}]
[]
[null,null,null,null,null,null,"LiveHealth Online",null,null,null,null,null,null,null,null,null,null,{"$f":"IF(M59=\"Yes\",\"Cannot have Teladoc when group currently has LiveHealth Online\",\"\")","v":""}]
[null,null,null,null,null,null,"Anthem4"]
[null,null,null,null,null,null,"Anthem5"]
[null,null,null,null,null,null,"Anthem6"]
[null,null,null,null,null,null,"Anthem7"]
[]
[null,null,null,null,null,null,"Simplicity"]
[null,null,null,null,null,null,"Cigna2"]
[null,null,null,null,null,null,"Cigna3"]
[null,null,null,null,null,null,"Cigna4"]
[null,null,null,null,null,null,"Cigna5"]
[null,null,null,null,null,null,"Cigna6"]
[null,null,null,null,null,null,"Cigna7"]
[]
[null,null,null,null,null,null,"Highmark1"]
[null,null,null,null,null,null,"Highmark2"]
[null,null,null,null,null,null,"Highmark3"]
[null,null,null,null,null,null,"Highmark4"]
[null,null,null,null,null,null,"Highmark5"]
[null,null,null,null,null,null,"Highmark6"]
[null,null,null,null,null,null,"Highmark7"]
[]
{"$rows_left_out":129}